Type,Account,Bill Year,Bill Sequence,Name 1,Name 2,Address 1,Address 2,Address 3,MapLot,Street Number,Apt,Street Name,Land,Building,Exempt,Exempt 1,Exempt 2,Exempt 3,Homestead Exemption,Book Page,Total Acres,Soft Acres,Soft Value,Mixed Acres,Mixed Value,Hard Acres,Hard Value,Reference 1,Reference 2,Tax Due 1,Tax Due 2
RE,1065,2023,1,26 SWEETWATER LLC,,64 HERSEY STR,,PORTLAND ME 04103,010-159,26,,SWEETWATER WAY,151800,541100,0,,,,0,B39304P173,17,0,0,0,0,0,0,OLD M/L 004-222-005 NOTES:        ,,6270.75,6270.74
RE,1083,2023,1,"274 GRAY RD N, LLC",,8 SCITTERYGUSSETT DR,,FALMOUHT ME 04105,014-099,274,,GRAY RD,86000,211500,0,,,,0,B38125P273,3.04,0,0,0,0,0,0,OLD M/L 005-011-001 NOTES:      ,"289,900",2692.38,2692.37
RE,1389,2023,1,"29 WEST POWNAL LLC,",,PO BOX 387,,FREEPORT ME 04032,009-089,29,,WEST POWNAL RD,108800,351800,0,,,,0,B15498P67 05/30/2000,7.6,0,0,0,0,0,0,NOTES:          ,,4168.43,4168.43
RE,1499,2023,1,"36 WALNUT HILL, LLC",,36 WALNUT HILL PARKWAY,,NORTH YARMOUTH ME 04097,010-162,36,,WALNUT HILL PARKWAY,81900,327800,0,,,,0,B33825P175,3.14,0,0,0,0,0,0,OLD M/L 004-227-014 NOTES:      ,,3707.79,3707.78
RE,285,2023,1,"414 LEDGE ROAD, LLC",,76 FORESIDE RD,,CUMBERLAND FSDE ME 04110,003-087,414,,LEDGE RD,209600,321600,0,,,,0,B35426P164,32.48,0,0,0,0,0,0,OLD M/L 002-091 NOTES:            ,,4807.36,4807.36
RE,1985,2023,1,"414 LEDGE ROAD, LLC",,76 FORESIDE RD,,CUMBERLAND FSDE ME 04110,003-087-001,412,,LEDGE RD,90600,898800,0,,,,0,B35426P164 01/25/2019,3.96,0,0,0,0,0,0, ,,8954.07,8954.07
RE,1046,2023,1,507 LLC,,507 WALNUT HILL RD,,NORTH YARMOUTH ME 04097,007-063,507,,WALNUT HILL RD,98500,182400,0,,,,0,B37314P179,1,0,0,0,0,0,0,NOTES:           ,,2542.15,2542.14
RE,1045,2023,1,"527, LLC",,865 OAK HILL RD,,NORTH YARMOUTH ME 04097,007-062,521,,WALNUT HILL RD,81800,172500,0,,,,0,B38201P160,2.2,0,0,0,0,0,0,NOTES: Antique  2010 - A ,"305,000",2301.42,2301.41
RE,1060,2023,1,"655 WALNUT HILL, LLC",,64 HERSEY ST,,PORTLAND ME 04103,010-148,655,,WALNUT HILL RD,90800,284900,0,,,,0,B36385P154,4,0,0,0,0,0,0,NOTES:       THE BARN AT WALNUT HILL,,3400.09,3400.08
RE,619,2023,1,"77 PROPERTY MANAGEMENT, LLC",,68 FELLOWS STREET,,SOUTH PORTLAND ME 04106,015-027,493,,GRAY RD,135300,0,0,,,,0,B39091P101,12.9,0,0,0,0,0,0,NOTES: 2011 CORRECTED SI ,,1224.47,1224.46
RE,1151,2023,1,"77 PROPERTY MANAGEMENT, LLC",,68 FELLOWS STREET,,SOUTH PORTLAND ME 04106,015-028,57,,DEER BROOK APARTMENTS,138300,561200,0,,,,0,B39091P101,25.5,0,0,0,0,0,0,OLD M/L 005-066-002 NOTES:      ,PREVIOUS TO DEC 1998 #104 GRAY RD,6330.48,6330.47
RE,2039,2023,1,"77 PROPERTY MANAGEMENT, LLC",,68 FELLOWS STREET,,SOUTH PORTLAND ME 04106,015-027-001,0,,GRAY RD,137700,0,137700,COMMON LAND,,,0,B39091P101,17.5,0,0,0,0,0,0,COMMON AREA PER PLAN BK221 PG175 ,,0,0
RE,1470,2023,1,ABBOTT MEGAN M & ERIC M,,40 WAYSIDE,,NORTH YARMOUTH ME 04097,002-032,40,,WAYSIDE,135500,365200,24750,HOMESTEAD.......,,,24750,B31451P293 04/18/2014,13.57,0,0,0,0,0,0,NOTES:               ,,4307.35,4307.35
RE,1701,2023,1,"ABBOTT, ROBERT W. & MARGARET S.",,86 HENRY RD,,NORTH YARMOUTH ME 04097,010-105,86,,HENRY RD,100000,255500,24750,HOMESTEAD.......,,,24750,B34283P13,4.02,0,0,0,0,0,0,OLD M/L 004-086-001-006 NOTES:         ,,2993.29,2993.29
RE,1375,2023,1,"ABRAHAM, MICHAEL S & LAURA F",,83 BIRCHWOOD TERRACE,,NORTH YARMOUTH ME 04097,016-077,83,,BIRCHWOOD TERRACE,95000,260500,24750,HOMESTEAD.......,,,24750,B26103P47,3.11,0,0,0,0,0,0,OLD M/L 006-045-014 NOTES:    ,,2993.29,2993.29
RE,613,2023,1,"ACKER, IAN &","KELLNDORFER, LISA",921 NORTH RD,,NORTH YARMOUTH ME 04097,003-044,921,,NORTH RD,83800,210800,24750,HOMESTEAD.......,,,24750,B36898P106,2.6,0,0,0,0,0,0,OLD M/L 002-074 NOTES:             ,,2442.15,2442.14
RE,1772,2023,1,"ADAIR, LUCAS",,594 WALNUT HILL RD,,NORTH YARMOUTH ME 04097,010-134,594,,WALNUT HILL RD,78800,155100,0,,,,0,B39149P329,1.59,0,0,0,0,0,0,NOTES: 2009 NEW ACCT              ,,2116.8,2116.79
RE,1084,2023,1,"ADAMS, ANN E","ADAMS, CLIFFORD D",6 COLONIAL DRIVE,,NORTH YARMOUTH ME 04097,007-008,6,,COLONIAL DR,84500,237300,24750,HOMESTEAD.......,,,24750,B15743P340,1.2,0,0,0,0,0,0,OLD M/L 004-241 NOTES:    ,,2688.31,2688.3
RE,1136,2023,1,"ADAMS, ANTHONY K & JEAN L JT",,7 HASKELL RD,,NORTH YARMOUTH ME 04097,014-054,7,,HASKELL RD,75800,175000,24750,HOMESTEAD.......,,,24750,B10604P185,1,0,0,0,0,0,0,OLD M/L 005-051-001 NOTES:        ,"120,400",2045.76,2045.75
RE,546,2023,1,"ADAMS, WALTER A & CYNTHIA W",,908 NORTH RD,,NORTH YARMOUTH ME 04097,002-080,908,,NORTH RD,90800,216700,24750,HOMESTEAD.......,,,24750,B38563P321,4,0,0,0,0,0,0,OLD M/L 002-044 NOTES:             ,,2558.89,2558.89
RE,166,2023,1,"ADSHEAD, CHRISTOPHER",,14 HENNINGS WAY,,NORTH YARMOUTH ME 04097,002-036,14,,HENNINGS WAY,92800,220000,24750,HOMESTEAD.......,,,24750,B32604P24,4.4,0,0,0,0,0,0,OLD M/L 001-199-002 NOTES:            ,TRANSFER PENDING,2606.86,2606.85
RE,1082,2023,1,"ADSHEAD, MICHELLE",,34 PARSONAGE ROAD,,NORTH YARMOUTH ME 04097,007-083,34,,PARSONAGE RD,75800,150700,24750,HOMESTEAD.......,,,24750,B32723P189,1,0,0,0,0,0,0,OLD M/L 004-235 NOTES:          ,TRANSFER PENDING,1825.84,1825.84
RE,580,2023,1,"AEA, LLC",,14 WHITE ROCK DRIVE,,GORHAM ME 04038,009-065,1367,,NORTH RD,95800,255500,0,,,,0,B35753P53,5,0,0,0,0,0,0,NOTES: 2009 corrected ac           ,,3179.27,3179.26
RE,653,2023,1,"AHLBERG, MATTHEW T. &","KREGLING, KATHERINE",543 WALNUT HILL RD,,NORTH YARMOUTH ME 04097,007-059,543,,WALNUT HILL RD,80800,227200,24750,HOMESTEAD.......,,,24750,B31862P243 10/22/2014 B25916P132,2,0,0,0,0,0,0,     ,,2563.42,2563.41
RE,737,2023,1,"AHLERS, JR., ALVIN K.",,1203 NORTH RD,,NORTH YARMOUTH ME 04097,006-011,1203,,NORTH RD,100800,333400,24750,HOMESTEAD.......,,,24750,B9980P152,6,0,0,0,0,0,0,OLD M/L 003-103-005 NOTES:                  ,,3705.53,3705.52
RE,1548,2023,1,"ALBERT, MARTHA M","ALBERT, SHAWN M",14 CARRIAGE HILL,,NORTH YARMOUTH ME 04097,010-065,14,,CARRIAGE HILL,116600,319000,24750,HOMESTEAD.......,,,24750,B31180P71 11/20/2013 B29746P259,7.04,0,0,0,0,0,0,NOTES:               ,,3718.2,3718.19
RE,1700,2023,1,"ALLEN, DANIEL E & MELISSA M",,20 PACKARD FARM RD,,NORTH YARMOUTH ME 04097,012-028,20,,PACKARD FARM RD,88600,420500,24750,HOMESTEAD.......,,,24750,B36626P264,1.94,0,0,0,0,0,0,OLD M/L 003-032-006 NOTES:         ,TRANSFER PENDING,4383.37,4383.37
RE,1451,2023,1,"ALLEN, DAVID C",,16 BEAR TRACKS TRAIL,,NORTH YARMOUTH ME 04097,004-004,16,,BEAR TRACKS TRAIL,93300,338600,24750,HOMESTEAD.......,,,24750,B19698P226,4.5,0,0,0,0,0,0,OLD M/L 001-184-008 NOTES:           ,"396,000",3684.71,3684.71
RE,1156,2023,1,"ALLEN, JONATHAN",,463 GRAY RD,,NORTH YARMOUTH ME 04097,015-033,463,,GRAY RD,83700,166000,0,,,,0,B27202P188,2.58,0,0,0,0,0,0,NOTES: 2006 CORRECTED ACRES      ,,2259.79,2259.78
RE,1172,2023,1,"ALLEN, KIMBERLY",,21 MILL RD,,NORTH YARMOUTH ME 04097,015-020,21,,MILL RD,75800,92000,0,,,,0,B38434P274,1,0,0,0,0,0,0,OLD M/L 005-089 NOTES:     ,,1518.59,1518.59
RE,416,2023,1,"ALLEN, RANDALL S",,228 WALNUT HILL RD,,NORTH YARMOUTH ME 04097,004-002,228,,WALNUT HILL RD,149400,131900,24750,HOMESTEAD.......,,,24750,B7280P343,16.5,0,0,0,0,0,0,NOTES:                              ,,2321.78,2321.78
RE,160,2023,1,"ALMODOBAR, ELIZABETH M",,12 SOUTHERLY VIEW LN,,NORTH YARMOUTH ME 04097,009-053,12,,SOUTHERLY VIEW LN,100100,406000,33250,SOL3 4000-7999 WATTS,HOMESTEAD.......,,24750,B16355P50 05/31/2001,12.35,0,0,0,0,0,0,NOTES: 2011 ADD DIMENSIO         ,,4279.3,4279.29
RE,790,2023,1,"ALNUAIMI, AHMED A","NEEMI, AZIZ A",10 CLIFFORD ST,,BIDDEFORD ME 04005,004-209,25,,CONIFER LANE,75900,338100,0,,,,0,B35133P167,1.01,0,0,0,0,0,0,OLD M/L 001-086 NOTES:          ,,3746.7,3746.7
RE,159,2023,1,"ALPERN, WARREN D",,28 SOUTHERLY VIEW LN,,NORTH YARMOUTH ME 04097,009-054,28,,SOUTHERLY VIEW LN,117900,747900,24750,HOMESTEAD.......,,,24750,B27711P3 04/14/2010 B27709P328 04/14/2010,20.54,0,0,0,0,0,0,NOTES: 2011REDUCE PER RI       ,,7611.51,7611.5
RE,219,2023,1,"AMERGIAN, LEON F",,70 TOWN FARM RD,,NORTH YARMOUTH ME 04097,016-089,70,,TOWN FARM RD,225600,153200,30690,VET VIETNAM RES,HOMESTEAD.......,,24750,B12624P200,48,0,0,0,0,0,0,OLD M/L 006-050-002 NOTES:                ,,3150.4,3150.39
RE,1872,2023,1,AMERICAN CLASSIC CHEVROLETS LLC,,PO Box 1659,,Gray ME 04039,008-028-001,2,,BOWDOIN COURT,76000,144900,0,,,,0,,1.07,0,0,0,0,0,0,         ,,1999.15,1999.14
RE,1044,2023,1,"AMES FAMILY, LLC",,326 GRAY RD,,NORTH YARMOUTH ME 04097,007-068,14,,THE LANE,109100,364900,0,,,,0,B24151P208,6.14,0,0,0,0,0,0,NOTES: 2007 ADDITION PER2415  ,,4289.7,4289.7
RE,846,2023,1,"AMES, JACQUELYN",,7 CUMBERLAND RD,,NORTH YARMOUTH ME 04097,004-051,7,,CUMBERLAND RD,69200,251500,0,,,,0,B35765P304,0.5,0,0,0,0,0,0,NOTES:       ,"234,000",2902.34,2902.33
RE,1147,2023,1,"AMES, JOHN S II","AMES, PAMELA C",326 GRAY RD,,NORTH YARMOUTH ME 04097,014-056,326,,GRAY RD,102100,234000,24750,HOMESTEAD.......,,,24750,B28884P232,6.25,0,0,0,0,0,0,OLD M/L 005-053 NOTES:                ,,2817.72,2817.72
RE,1373,2023,1,AMOUSSOU-GUENOU ULRICH,"TAGNE, CAROLINE N",354 MILL RD,,NORTH YARMOUTH ME 04097,016-048,354,,MILL RD,75800,162900,24750,HOMESTEAD.......,,,24750,B33563P200,1,0,0,0,0,0,0,OLD M/L 006-045-016 NOTES:      ,,1936.25,1936.25
RE,1895,2023,1,"AMPEZZAN, ANTHONY",,24 THUNDER RD,,NORTH YARMOUTH ME 04097,011-032-001,24,,THUNDER RD,76000,343700,0,,,,0,B39091P248,1.03,0,0,0,0,0,0,  ,,3798.29,3798.28
RE,1752,2023,1,"ANDERSEN, DAVID J & TERRI L",,28 KNIGHT WAY,,NORTH YARMOUTH ME 04097,008-046,28,,KNIGHT WAY,103400,480200,24750,HOMESTEAD.......,,,24750,B35301P159 11/20/2018 B22054P39,1.75,0,0,0,0,0,0,NOTES: 2010 VALUE AS SEP ,,5057.6,5057.59
RE,1750,2023,1,"ANDERSEN, OLAF S & JUDITH M",,73 KNIGHT WAY,,NORTH YARMOUTH ME 04097,008-052,73,,KNIGHT WAY,99700,781100,33250,SOL3 4000-7999 WATTS,HOMESTEAD.......,,24750,B37306P191,1.19,0,0,0,0,0,0,NOTES: 2010 VALUE AS SEP    ,,7670.33,7670.33
RE,203,2023,1,"ANDERSON, HILLARY E.H & COLIN S",,405 DEER RIDGE,,NORTH YARMOUTH ME 04097,001-040,405,,DEER RIDGE,78800,113500,24750,HOMESTEAD.......,,,24750,B37477P302,1.6,0,0,0,0,0,0,OLD M/L 001-172 NOTES:    ,,1516.33,1516.33
RE,115,2023,1,"ANDERSON, JOSEPH J & LAUREN",,695 SLIGO RD,,NORTH YARMOUTH ME 04097,002-025,695,,SLIGO RD,93800,294900,24750,HOMESTEAD.......,,,24750,B34958P52,4.6,0,0,0,0,0,0,OLD M/L 001-193 NOTES:              ,,3293.75,3293.75
RE,478,2023,1,"ANDERSON, JR., ROBERT",,397 MEMORIAL HIGHWAY,,NORTH YARMOUTH ME 04097,008-074,397,,MEMORIAL HIGHWAY,163600,463700,24750,HOMESTEAD.......,,,24750,B6264P116,7.19,0,0,0,0,0,0,NOTES: 2005 REDID LOT PE     ,,5453.08,5453.08
RE,829,2023,1,"ANDERSON, LESLIE L",,384 MEMORIAL HIGHWAY,,NORTH YARMOUTH ME 04097,008-062,384,,MEMORIAL HIGHWAY,97800,289800,24750,HOMESTEAD.......,,,24750,B23218P50,5.39,0,0,0,0,0,0,NOTES: 2005 SOLD 16 ACRE  ,,3283.8,3283.79
RE,825,2023,1,"ANDERSON, ROBERT H JR",,397 MEMORIAL HIGHWAY,,NORTH YARMOUTH ME 04097,008-061,352,,MEMORIAL HIGHWAY,166200,469600,0,,,,0,B35196P288,20.04,0,0,0,0,0,0,NOTES: 2005 REDUCE PER S    ,,5753.99,5753.99
RE,2019,2023,1,"ANDERSON, ROBERT H JR",,397 MEMORIAL HIGHWAY,,NORTH YARMOUTH ME 04097,008-055-001,352,,MEMORIAL HIGHWAY,83400,0,0,,,,0,B35196P288,2.52,0,0,0,0,0,0, ,,754.77,754.77
RE,1391,2023,1,"ANDERSON, SHAUN & BRECKON",,37 RANI DR,,NORTH YARMOUTH ME 04097,009-101,37,,RANI DRIVE,85300,253300,24750,HOMESTEAD.......,,,24750,B27238P207,1.35,0,0,0,0,0,0,OLD M/L 003-147 NOTES:        ,,2840.35,2840.34
RE,520,2023,1,"ANDERSSON, MARGARETA E & CHRISTOPHER L",,40 SANDPIPER COVE RD,,YARMOUTH ME 04096,002-096,41,,DEER RUN RD,69400,119900,0,,,,0,B38325P296,0.56,0,0,0,0,0,0,   ,,1713.17,1713.16
RE,34,2023,1,"ANDREASEN, MICHEAL S","ANDREASEN, KIM T",224 HALLOWELL RD,,NORTH YARMOUTH ME 04097,009-103,224,,HALLOWELL RD,85000,232400,24750,HOMESTEAD.......,,,24750,B12048P348,2.83,0,0,0,0,0,0,OLD M/L 003-070 NOTES:      ,,2648.49,2648.48
RE,1386,2023,1,ANDREW B. WALSH LIVING TRUST DATED83019,,10 FIREFLY LN,,NORTH YARMOUTH ME 04097,007-106,10,,FIREFLY LN,95600,360200,33250,SOL3 4000-7999 WATTS,HOMESTEAD.......,,24750,B35945P259,3.21,0,0,0,0,0,0,NOTES: INCL 007-104 2008  ,,3824.08,3824.08
RE,1424,2023,1,"ANDREWS, BRUCE S & MARY L",,315 NEW GLOUCESTER RD,,NORTH YARMOUTH ME 04097,011-054,315,,NEW GLOUCESTER RD,144000,277700,24750,HOMESTEAD.......,,,24750,B38180P334,15.35,0,0,0,0,0,0,   ,,3592.4,3592.4
RE,664,2023,1,"ANDREWS, CAROL A",,1501 NORTH RD,,NORTH YARMOUTH ME 04097,012-037,1501,,NORTH RD,79700,186600,24750,HOMESTEAD.......,,,24750,B15878P66,1.77,0,0,0,0,0,0,OLD M/L 003-037 NOTES:         ,,2186.03,2186.03
RE,196,2023,1,"ANDREWS, ELISABETH V","SANDERSON, MATTHEW B",4 BRYN LANE,,NORTH YARMOUTH ME 04097,004-163,4,,BRYN LANE,79300,314600,24750,HOMESTEAD.......,,,24750,B35208P49,1.69,0,0,0,0,0,0,NOTES:                ,,3340.81,3340.81
RE,428,2023,1,"APPAVOO, JOHNSON (JT)","JOHNSON, JEFFERY & CHRISTINE",32 STOWELL BROOKE RD,,NORTH YARMOUTH ME 04097,016-011,32,,STOWELL BROOKE,121500,435700,24750,HOMESTEAD.......,,,24750,B36109P41,4.54,0,0,0,0,0,0,   ,,4818.68,4818.67
RE,849,2023,1,APPLE BROOK DRIVE SUBD HMOWNER ASS,,40 FARMGATE RD,,FALMOUTH ME 04105,001-006,0,,APPLE BROOK DRIVE,84000,0,84000,COMMON LAND,,,0,B35306P145,2.63,0,0,0,0,0,0,OLD M/L 001-164 NOTES:       ,Was HONEY COMB DR,0,0
RE,1676,2023,1,"APPLIN, PEGGY JONAS",,827 SLIGO RD,,NORTH YARMOUTH ME 04097,005-025,827,,SLIGO RD,100800,161600,24750,HOMESTEAD.......,,,24750,B23761P168,6,0,0,0,0,0,0,NOTES:               ,,2150.74,2150.73
RE,1176,2023,1,"ARBEGAST, JASON & APRIL",,373 GRAY RD,,NORTH YARMOUTH ME 04097,014-073,373,,GRAY RD,82800,200000,24750,HOMESTEAD.......,,,24750,B34939P335,2.39,0,0,0,0,0,0,OLD M/L 005-094 NOTES:       ,,2335.36,2335.35
RE,290,2023,1,"ARGEREOW, PAUL",,168 HASKELL RD,,NORTH YARMOUTH ME 04097,014-019,168,,HASKELL RD,75800,179000,24750,HOMESTEAD.......,,,24750,B6596P226,1,0,0,0,0,0,0,OLD M/L 005-027 NOTES:   ,,2081.96,2081.95
RE,406,2023,1,"ARGUELLES, ADAM J. & MEGAN E",,60 MEREWIND DR,,CUMBERLAND ME 04021,001-025,0,,BROWNS WAY,106300,18000,0,,,,0,B34883P254 05/22/2018,7.09,0,0,0,0,0,0,OLD M/L 001-149-001 NOTES:        ,,1124.92,1124.91
RE,1320,2023,1,"ARMSTRONG, ROBERT G","ARMSTRONG, LINDA A",525 NEW GLOUCESTER RD,,NORTH YARMOUTH ME 04097,016-133,525,,NEW GLOUCESTER RD,77900,195900,30690,VET VIETNAM RES,HOMESTEAD.......,,24750,B28694P134 05/12/2011,1.42,0,0,0,0,0,0,OLD M/L 007-022-003 NOTES:       ,,2200.15,2200.14
RE,1580,2023,1,"ARNOLD, WILLIAM C",,19 STOWELL BROOKE,,NORTH YARMOUTH ME 04097,016-024,19,,STOWELL BROOKE,109900,400200,24750,HOMESTEAD.......,,,24750,B22708P285,2.76,0,0,0,0,0,0,NOTES:             ,,4392.42,4392.42
RE,2099,2023,1,"ARSENAULT, JOSEPH A",,173 CUMBERLAND ROAD,,NORTH YARMOUTH ME 04097,013-047-001,0,,WEST POWNAL RD,121700,0,0,,,,0,B39164P333,10.67,0,0,0,0,0,0, ,,1101.39,1101.38
RE,1000,2023,1,"ASHLEY, ROBERT A",,1074 SLIGO RD,,NORTH YARMOUTH ME 04097,008-043,1074,,SLIGO RD,96400,297300,24750,HOMESTEAD.......,,,24750,B22086P88,5.11,0,0,0,0,0,0,NOTES:           ,,3339,3339
RE,1640,2023,1,"ASHTON, DANIELLE M",,45 FOREST RIDGE DRIVE,,NORTH YARMOUTH ME 04097,010-057,45,,FOREST RIDGE DR,85000,301500,0,,,,0,B32207P224,2.83,0,0,0,0,0,0,LOT #3    ,TRANSFER PENDING,3497.83,3497.82
RE,592,2023,1,"ATKINS, MICHELE RENEE",,98 HAYWOOD LN,,NORTH YARMOUTH ME 04097,009-008,98,,HAYWOOD LN,94700,366000,24750,HOMESTEAD.......,,,24750,B30758P8 06/14/2013,4.77,0,0,0,0,0,0,NOTES:         ,,3945.35,3945.35
RE,1695,2023,1,ATLANTIC OPTIONS,C/O KLAUS KIAER,27 DEAR BROOK FARM,,NORTH YARMOUTH ME 04097,010-030,0,,,4100,0,0,,,,0,,14.4,0,0,0,0,0,0,NOTES: common lot value    ,,37.11,37.1
RE,992,2023,1,"AUDETTE, JR., RONALD C.",,46 THUNDER RD,,NORTH YARMOUTH ME 04097,011-035,46,,THUNDER RD,95600,148800,24750,HOMESTEAD.......,,,24750,B23148P250,4.96,0,0,0,0,0,0,NOTES: 2006 ADDED LAND F   ,,1987.84,1987.83
RE,1686,2023,1,"AUSTIN HOLDINGS COMPANY, LLC",,278 DURHAM ROAD,,NEW GLOUCESTER ME 04260,007-110,28,,THE LANE,79500,164000,0,,,,0,B36435P206,1.73,0,0,0,0,0,0,NOTES: 2007 ADDITION PER        ,,2203.68,2203.67
RE,1358,2023,1,"AUSTIN, ERIC P",,95 MILLIKEN RD,,NORTH YARMOUTH ME 04097,012-010,95,,MILLIKEN RD,89800,255200,24750,HOMESTEAD.......,,,24750,B15496P317,3.8,0,0,0,0,0,0,NOTES:               ,,2898.27,2898.26
RE,1957,2023,1,"AVERY, TYLER & ELYSIA A",,11 DANDELION DR,,NORTH YARMOUTH ME 04097,009-014-003,11,,DANDELION DR,85800,309100,0,,,,0,B36289P72,3,0,0,0,0,0,0,B35461P127   ,,3573.85,3573.84
RE,1362,2023,1,"BABCOCK, DAVID A",,1540 NORTH RD,,NORTH YARMOUTH ME 04097,012-053,1540,,NORTH RD,100800,168000,24750,HOMESTEAD.......,,,24750,B15311P341,6,0,0,0,0,0,0,OLD M/L 007-071-001 NOTES:         ,foreclosure docket#PORDC-RE-12 9/28/2012,2208.66,2208.65
RE,1933,2023,1,"BABER, ASHLEY N & MATTHEW",,4 GARDEN GATE CIRCLE,,NORTH YARMOUTH ME 04097,001-006-002,4,,GARDEN GATE CIRCLE,69000,282900,24750,HOMESTEAD.......,,,24750,B36926P238,0.47,0,0,0,0,0,0,        ,,2960.71,2960.71
RE,208,2023,1,"BABIN, MICHAEL S",,16 MEADOWCREEK LANE,,NORTH YARMOUTH ME 04097,004-185,16,,MEADOWCREEK LANE,83800,285200,24750,HOMESTEAD.......,,,24750,B4422P125,2.6,0,0,0,0,0,0,OLD M/L 001-104 NOTES:                 ,,3115.47,3115.46
RE,646,2023,1,"BACALL, CHARLES P",,392 WALNUT HILL RD,,NORTH YARMOUTH ME 04097,004-116,392,,WALNUT HILL RD,78500,576100,24750,HOMESTEAD.......,,,24750,B25603P161,1.54,0,0,0,0,0,0,NOTES: 2000 Reduce due t        ,,5700.15,5700.14
RE,47,2023,1,"BACHELDER, LAURIE A",,865 OAK HILL RD,,NORTH YARMOUTH ME 04097,008-026,865,,OAK HILL RD,86500,427600,24750,HOMESTEAD.......,,,24750,B34941P113,3.13,0,0,0,0,0,0,NOTES:           ,3.13 acres,4428.62,4428.62
RE,22,2023,1,"BAHLKOW, GARY D",,50 WEST POWNAL RD,,NORTH YARMOUTH ME 04097,013-056,50,,WEST POWNAL RD,174300,228200,33250,SOL3 4000-7999 WATTS,HOMESTEAD.......,,24750,B33793P323,73.07,0,0,0,0,0,0,NOTES:          ,,3341.72,3341.71
RE,360,2023,1,"BAHLKOW, SOPHIA LEE & MARKS, DANIEL B","BAHLKOW, ASHLEY PIPER",68 WEST POWNAL RD,,NORTH YARMOUTH ME 04097,013-057,68,,WEST POWNAL RD,83000,290500,33250,HOMESTEAD.......,SOL3 4000-7999 WATTS,,24750,B33671P153,2.43,0,0,0,0,0,0,NOTES: 2011 reduce per s     ,abate#17-03,3079.27,3079.26
RE,881,2023,1,"BAILEY, ROBERT H & KIMBERLY ANN",,404 WALNUT HILL RD,,NORTH YARMOUTH ME 04097,007-024,404,,WALNUT HILL RD,75800,133300,30690,HOMESTEAD.......,VET VIETNAM RES,,24750,B37779P297,1,0,0,0,0,0,0,NOTES:           ,,1614.61,1614.61
RE,1623,2023,1,"BAILEY, STEPHEN E & SUSAN A",,4 BROOKVIEW LANE,,NORTH YARMOUTH ME 04097,003-033,4,,BROOKVIEW LANE,141600,333100,24750,HOMESTEAD.......,,,24750,B33686P51,2.03,0,0,0,0,0,0,OLD M/L 002-077-023 NOTES:      ,GRANITE FALLS SUBDIVISION LOT 23,4072.05,4072.05
RE,246,2023,1,"BAILEY, STUART M","JOHNSON, SARAH N",62 BAYBERRY DR,,NORTH YARMOUTH ME 04097,004-179,62,,BAYBERRY DR,76300,190300,24750,HOMESTEAD.......,,,24750,B29715P334,1.1,0,0,0,0,0,0,NOTES:              ,,2188.75,2188.74
RE,1073,2023,1,BAILKENZIE PROPERTIES LLC,,42 WALNUT HILL PKWY,,NORTH YARMOUTH ME 04097,010-165,14,,WALNUT HILL PARKWAY,119900,262000,0,,,,0,B24795P291,5.27,0,0,0,0,0,0,OLD M/L 004-227-001 NOTES:  ,,3456.2,3456.19
RE,982,2023,1,"BAKER, BRADLEY R & ANDREA M",,33 LUFKIN RD,,NORTH YARMOUTH ME 04097,011-012,33,,LUFKIN RD,75800,187800,0,,,,0,B32207P142,1,0,0,0,0,0,0,NOTES:         ,TRANSFER PENDING,2385.58,2385.58
RE,784,2023,1,"BAKER, RICHARD E",,37 HAWTHORNE RD,,NORTH YARMOUTH ME 04097,003-079,37,,HAWTHORNE RD,105600,267200,24750,HOMESTEAD.......,,,24750,B7616P33,5.04,0,0,0,0,0,0,OLD M/L 002-093-003 NOTES:   ,,3149.86,3149.85
RE,181,2023,1,"BAKUTIS, ALAN T",,200 SWEETSER RD,,NORTH YARMOUTH ME 04097,005-004,200,,SWEETSER RD,98300,312500,33250,SOL3 4000-7999 WATTS,HOMESTEAD.......,,24750,B3053P14,5.49,0,0,0,0,0,0,NOTES:            ,,3416.83,3416.83
RE,1437,2023,1,"BALDWIN, JOHN S",,64 HASKELL RD,,NORTH YARMOUTH ME 04097,014-006,64,,HASKELL RD,110500,204600,24750,HOMESTEAD.......,,,24750,B12809P158,7.94,0,0,0,0,0,0,OLD M/L 005-016-002 NOTES:     ,9/7/2011 FORECLOSURE ACTION FROM BAC FILED,2627.67,2627.67
RE,1970,2023,1,"BARIL, ROBERT T & KRISTA G",,104 VILLAGE VIEW LANE,,NORTH YARMOUTH ME 04907,007-034-008,104,,VILLAGE VIEW LN,161500,910600,30690,HOMESTEAD.......,VET PERSIAN GULF RES,,24750,B35449P52,4.3,0,0,0,0,0,0,     ,,9424.76,9424.76
RE,302,2023,1,"BARNES, RYAN J. & KELLY D",,823 SLIGO RD,,NORTH YARMOUTH ME 04097,005-024,823,,SLIGO RD,100800,295900,24750,HOMESTEAD.......,,,24750,B29067P71 10/26/2011,6,0,0,0,0,0,0,NOTES: 2006 REDUCE PER S    ,,3366.15,3366.15
RE,1416,2023,1,"BARNES, TIMOTHY E. & ROBYN R.",,176 MILLIKEN RD,,NORTH YARMOUTH ME 04097,017-050,176,,MILLIKEN RD,77100,184400,24750,HOMESTEAD.......,,,24750,B12242P110,1.25,0,0,0,0,0,0,OLD M/L 007-032-001 NOTES:       ,,2142.59,2142.59
RE,438,2023,1,"BARNICKEL, LAWRENCE S",,38 FARMS EDGE RD,,NORTH YARMOUTH ME 04097,002-058,38,,FARMS EDGE RD,106400,304800,24750,HOMESTEAD.......,,,24750,B11001P331,5.18,0,0,0,0,0,0,OLD M/L 002-049-009 NOTES:              ,,3497.38,3497.37
RE,965,2023,1,"BARNS, WILLIAM H & JENNIFER H",,47 DERBY LANE,,NORTH YARMOUTH ME 04097,010-006,47,,DERBY LANE,95900,648900,24750,HOMESTEAD.......,,,24750,B34271P46,5.01,0,0,0,0,0,0,OLD M/L 004-141-006 NOTES:     ,,6516.46,6516.45
RE,260,2023,1,"BARR, STEPHEN & LEGGAT, MARTHA G",,263 MOUNTFORT RD,,NORTH YARMOUTH ME 04097,003-110,263,,MOUNTFORT RD,129000,395500,33250,SOL3 4000-7999 WATTS,HOMESTEAD.......,,24750,B15707P141,15,0,0,0,0,0,0,OLD M/L 002-103 NOTES:       ,,4445.82,4445.81
RE,1601,2023,1,"BARR, STEPHEN & LEGGAT, MARTHA JT",,263 MOUNTFORT RD,,NORTH YARMOUTH ME 04097,003-074-A,0,,MOUNTFORT RD,203000,0,0,,,,0,B21727P253,39.85,0,0,0,0,0,0,OLD M/L 002-096-003 NOTES:    ,17-ABATED FOR MERGER OF LOTS TO#110,1837.15,1837.15
RE,624,2023,1,"BARR, STEPHEN J & LEGGAT, MARTHA G JT",,263 MOUNTFORT RD,,NORTH YARMOUTH ME 04097,003-071,0,,MOUNTFORT RD,211300,0,0,,,,0,B32901P233,32.88,0,0,0,0,0,0,OLD M/L 002-097-001 NOTES:     ,17 ABATED TO CORRECT AC,1912.27,1912.26
RE,995,2023,1,"BARRON, SANDRA M",,20 THUNDER RD,,NORTH YARMOUTH ME 04097,011-032,20,,THUNDER RD,78200,181200,24750,HOMESTEAD.......,,,24750,B12550P303,1.47,0,0,0,0,0,0,OLD M/L 004-165-003 NOTES:      ,,2123.59,2123.58
RE,1923,2023,1,"BARRY, LAURA LEE ARIEL &","WOMMACK, SANDERS RINGDAHL",53 RIDGEWOOD LN,,NORTH YARMOUTH ME 04097,008-016-008,53,,RIDGEWOOD LN,80800,470400,24750,HOMESTEAD.......,,,24750,B37362P213,2,0,0,0,0,0,0,         ,,4764.38,4764.37
RE,351,2023,1,"BARTER, BLAINE J",,176 WALNUT HILL RD,,NORTH YARMOUTH ME 04097,001-051,176,,WALNUT HILL RD,75800,112500,24750,HOMESTEAD.......,,,24750,B1179P22,1,0,0,0,0,0,0,NOTES:       ,,1480.13,1480.13
RE,627,2023,1,"BARTER, FRED W",,660  WALNUT HILL RD,,NORTH YARMOUTH ME 04097,010-079,660,,WALNUT HILL RD,76000,174900,24750,HOMESTEAD.......,,,24750,B4471P334,1.03,0,0,0,0,0,0,NOTES:                 ,,2046.66,2046.66
RE,1091,2023,1,"BARTER, RALPH",,3 TIMS RD,,GRAY ME 04039,014-003,0,,HASKELL RD,11900,0,0,,,,0,B6589P262,10,0,0,0,0,0,0,OLD M/L 005-033 NOTES:         ,,107.7,107.69
RE,172,2023,1,"BASTON, CLARK M",,282 SWEETSER RD,,NORTH YARMOUTH ME 04097,001-091,282,,SWEETSER RD,90800,253400,40750,SOL4 8000-15999 WATTS,HOMESTEAD.......,,24750,B9672P334,4,0,0,0,0,0,0,NOTES:               ,,2746.23,2746.22
RE,696,2023,1,"BASTON, RICHARD M",C/O CLARK BASTON,282 SWEETSER RD,,NORTH YARMOUTH ME 04097,001-097,0,,SWEETSER RD,92300,0,0,,,,0,,30.8,0,0,0,0,0,0,NOTES: SEE 001-092     ,,835.32,835.31
RE,315,2023,1,"BASTON, RICHARD M. AND CLARK M.",,282 SWEETSER RD,,NORTH YARMOUTH ME 04097,001-092,0,,SWEETSER RD,23300,0,0,,,,0,B35894P289,55.76,0,0,0,0,0,0,"NOTES: INCL 002-014, 002     ",,210.87,210.86
RE,1900,2023,1,"BATSON, MELODIE J",,22 HAZEL LANE,,NORTH YARMOUTH ME 04097,008-064-013,22,,HAZEL LANE,68200,310600,24750,HOMESTEAD.......,,,24750,B33723P276,0.31,0,0,0,0,0,0,17- ABATED TO CORRECT BLD SKETCH    ,,3204.16,3204.15
RE,736,2023,1,"BEAN, DAVID M",,1185 NORTH RD,,NORTH YARMOUTH ME 04097,006-012,1185,,NORTH RD,80800,174200,24750,HOMESTEAD.......,,,24750,B27427P91,5,0,0,0,0,0,0,OLD M/L 003-103-003 NOTES:     ,,2083.77,2083.76